{"text_format":"1","workbook":"xlsx","n_sheets":16,"sheets":["Instructions","Index","A - Annual Report","B - Presentation & Policies","C - SoPS","D - SoCNE","E - SoFP","F - SoCF","G - SoC in TE","H - Notes","I - Consolidated FS","J - Bus Comb","K - Interim Reports","L - Summary FS","List of IFRSs","List of abbreviations"],"not_rendered":{"charts":0,"images":7,"macros":0,"external_links":0,"defined_names":16,"comments":1,"pivot_tables":0},"unopened":[],"bounds":{"document_bytes":16777216,"sheet_cells":100000,"rows_first":2000,"rows_last":500,"rows_between":2000,"halvings":0,"cell_chars":16384,"cell_head_chars":4096},"cells_cut":0,"cells_raw":0,"read":"whole","date_system":"1900"}

{"sheet":"Instructions","index":0,"n_rows":18,"n_cols":2,"rows_kept":18,"cut":false,"hidden":false,"merged":[]}
[null," "]
[null,"Disclosure Guide 2011-12"]
[null,"1. This guide is designed to ensure that audited entities have prepared annual report and accounts in the appropriate form and complied with all disclosure requirements. The guide is intended to be used for those entities covered by the FReM, that is, to reporting entities and reportable activities that are prepared on an accruals basis and consolidated within Whole of Government Accounts (FReM 1.1.2). Reporting entities must prepare and publish an annual report and accounts as a single document (FReM 5.1.1); the format and content of the annual report and accounts of reportable activities are set out in the relevant accounts directions (FReM 5.1.3)."]
[null,"Scope"]
[null,"2. This guide therefore applies fully and directly to departments, Supply-financed executive agencies, and NDPBs (except for NDPBs that are incorporated as companies, or that have charitable status, or are both registered companies and charities)  The FReM should also be applied to reportable activities (such as funds and flows of income and expenditure), but only to the extent that it is relevant to those activities and in the light of any statutory requirements or other pronouncements made by the relevant authorities (FReM 1.6.1). "]
[null,"3. NDPBs that are incorporated as companies should comply with the Companies Act 2006, and NDPBs that have charitable status should comply with regulations issued under charities legislation and, where applicable, the Statement of Recommended Practice Accounting by Charities (\"the Charities SORP\"). NDPBs that are both registered companies and charities should comply with both the Companies Act 2006 and the Charities SORP. All these NDPBs should also follow the principles in the FReM and provide the additional disclosures required by the FReM (e.g. on notional costs and salary and pension entitlements) where these go beyond the Companies Act 2006 and/or the SORP, as applicable (FReM 1.4.1). A separate disclosure guide is available for charitable NDPBs, which should be used in preference to this guide."]
{"$rows_left_out":13}
{"sheet":"Index","index":1,"n_rows":102,"n_cols":7,"rows_kept":102,"cut":false,"hidden":false,"merged":[]}
[null,"INDEX","FILTER"]
[null,{"$f":"Instructions!B2","v":"Disclosure Guide 2011-12"}]
["Mandatory","SECTION A: ANNUAL REPORT"]
["Mandatory","SECTION B: PRESENTATION OF FINANCIAL STATEMENTS AND ACCOUNTING POLICIES "]
["Departments only","SECTION C: STATEMENT OF PARLIAMENTARY SUPPLY "]
["Mandatory","SECTION D: STATEMENT OF COMPREHENSIVE NET EXPENDITURE"]
{"$rows_left_out":97}
{"sheet":"A - Annual Report","index":2,"n_rows":385,"n_cols":6,"rows_kept":385,"cut":false,"hidden":false,"merged":[]}
[null,"FReM DISCLOSURE GUIDE 2011-12","Subsection applicable?","Response","Ref","Comments/links"]
[null,"SECTION A: ANNUAL REPORT, ACCOUNTING OFFICER'S RESPONSIBILITIES, GOVERNANCE STATEMENT",null,{"$f":"IF((AND(D3<>\"no\",D364<>\"no\",D371<>\"no\")),\"\",\"no\")","v":""}]
["A1","ANNUAL REPORT\n",null,{"$f":"IF((AND(D12<>\"no\",D22<>\"no\",D63<>\"no\",D314<>\"no\",D318<>\"no\",D321<>\"no\")),\"\",\"no\")","v":""}]
[null,"Scope"]
[null,"All entities covered by the FReM must include an annual report with their financial statements (except charitable NDPBs, for which a separate disclosure guide is available and should be used in preference to this guide). The form of the Annual Report is largely for the entity to determine and the entity may include relevant information to reflect its circumstances. However, the Annual Report must include information which the Companies Act requires of a directors' report and a remuneration report.",null,null,"FReM 5.2.1"]
[null,"All departments must lay and publish a combined Annual Report and Accounts document for the group covering the year to 31 March 2012",null,null,"1.2 - PES (2011) 10"]
{"$rows_left_out":380}
{"sheet":"B - Presentation & Policies","index":3,"n_rows":286,"n_cols":6,"rows_kept":286,"cut":false,"hidden":false,"merged":[]}
[null,{"$f":"'A - Annual Report'!B1","v":"FReM DISCLOSURE GUIDE 2011-12"},"Subsection applicable?","Response","Ref","Comments/links"]
[null,"SECTION B: PRESENTATION OF FINANCIAL STATEMENTS AND ACCOUNTING POLICIES",null,{"$f":"IF((AND(D3<>\"no\",D183<>\"no\",D115<>\"no\",D172<>\"no\",D92<>\"no\",D96<>\"no\",D99<>\"no\",D103<>\"no\",D249<>\"no\",D204<>\"no\",D193<>\"no\",D10<>\"no\",D216<>\"no\")),\"\",\"no\")","v":""}]
["B1","GENERAL",null,{"$f":"IF((AND(D4<>\"no\",D5<>\"no\",D6<>\"no\",D7<>\"no\",D8<>\"no\",D9<>\"no\")),\"\",\"no\")","v":""}]
["B1.1","Do the figures in the accounts agree with the adjusted consolidated trial balance?"]
["B1.2","Do the accounts cast and cross-cast?"]
["B1.3","Where figures in the prime statements are supported by notes, have they all been cross-referenced?"]
{"$rows_left_out":281}
{"sheet":"C - SoPS","index":4,"n_rows":110,"n_cols":6,"rows_kept":110,"cut":false,"hidden":false,"merged":[]}
[null,{"$f":"'A - Annual Report'!B1","v":"FReM DISCLOSURE GUIDE 2011-12"},"Subsection applicable?","Response","Ref","Comments/links"]
[null,"SECTION C: STATEMENT OF PARLIAMENTARY SUPPLY\nAND RELATED NOTES",null,{"$f":"IF((AND(D5<>\"no\",D28<>\"no\",D81<>\"no\",#REF!<>\"no\",D89<>\"no\",D103<>\"no\")),\"\",\"no\")","v":{"$error":"#REF!"}}]
[null,"Note (1): this worksheet is for departments only."]
[null,"Note (2): this worksheet incorporates the Supply Checklist. There is no separate Supply Checklist to complete."]
["C1","STATEMENT OF PARLIAMENTARY SUPPLY",null,{"$f":"IF((AND(D6<>\"no\",#REF!<>\"no\",D14<>\"no\",#REF!<>\"no\",D23<>\"no\")),\"\",\"no\")","v":{"$error":"#REF!"}}]
["C1.1","Note (1): The Statement of Parliamentary Supply is the parliamentary accountability statement. ",null,null,"FReM 3.2.2   "]
{"$rows_left_out":105}
{"sheet":"D - SoCNE","index":5,"n_rows":262,"n_cols":6,"rows_kept":262,"cut":false,"hidden":false,"merged":[]}
[null,{"$f":"'B - Presentation & Policies'!B1","v":"FReM DISCLOSURE GUIDE 2011-12"},"Subsection applicable?","Response","Ref","Comments/links"]
[null,"SECTION D: STATEMENTOF COMPREHENSIVE NET EXPENDITURE",null,{"$f":"IF((AND(D3<>\"no\",D90<>\"no\",D136<>\"no\",D242<>\"no\",D183<>\"no\",D146<>\"no\",D71<>\"no\",D39<>\"no\")),\"\",\"no\")","v":{"$error":"#REF!"}}]
["D1","GENERAL",null,{"$f":"IF((AND(D6<>\"no\",D10<>\"no\",D13<>\"no\",D15<>\"no\",D28<>\"no\")),\"\",\"no\")","v":""}]
[null,"Note (1): IAS 1 requires entities to prepare a statement of comprehensive income, that may be presented as a single statement of comprehensive income, or as two statements: one displaying components of profit or loss (separate income statement) and a second statement beginning with profit or loss and displaying components of other comprehensive income (statement of comprehensive income). The components of profit or loss equate to income and expenditure previously included in the operating cost statement, income statement or equivalent; the components of other comprehensive income to items previously included in the statement of (total) recognised gains and losses. Departments, [executive agencies], NDPBs and Trading Funds should follow the guidance in the FReM, which requires the preparation of a Statement of Comprehensive Net Expenditure (or where appropriate for certain NDPBs and Trading Funds a Statement of Comprehensive Income) - equivalent to the single statement of comprehensive income in IAS 1. ",null,null,"IAS 1.10 (b) and 1. 81\nFReM 5.4.8"]
[null,"Note (2): for convenience, the title \"Statement of Comprehensive Net Expenditure\" is used throughout to refer to this statement and its equivalents."]
["D1.1","For departments preparing annual accounts and executive agencies preparing financial statements under the Government Resources and Accounts Act 2000 or under the Government Resources and Accounts Act (Northern Ireland) 2001, has the Statement of Comprehensive Net Expenditure been prepared in accordance with the format shown under FReM 5.4.9?",null,null,"FReM 5.4.9"]
{"$rows_left_out":257}
{"sheet":"E - SoFP","index":6,"n_rows":1333,"n_cols":6,"rows_kept":1333,"cut":false,"hidden":false,"merged":[]}
[null,{"$f":"'B - Presentation & Policies'!B1","v":"FReM DISCLOSURE GUIDE 2011-12"},"Subsection applicable?","Response","Ref","Comments/links"]
[null,"SECTION E: STATEMENT OF FINANCIAL POSITION",null,{"$f":"IF((AND(D3<>\"no\",D64<>\"no\",D185<>\"no\",D217<>\"no\",D265<>\"no\",D321<>\"no\",D330<>\"no\",D335<>\"no\",D541<>\"no\",D573<>\"no\",D648<>\"no\",D684<>\"no\",D700<>\"no\",D724<>\"no\",D728<>\"no\",D758<>\"no\",D865<>\"no\",D941<>\"no\",D1261<>\"no\",D1279<>\"no\",D1299<>\"no\")),\"\",\"no\")","v":{"$error":"#REF!"}}]
["E1","GENERAL",null,{"$f":"IF((AND(D4<>\"no\",D11<>\"no\",D19<>\"no\",D26<>\"no\",D52<>\"no\")),\"\",\"no\")","v":""}]
[null,"Format and the current/non-current distinction",null,{"$f":"IF((AND(D5<>\"no\",D9<>\"no\",D10<>\"no\")),\"\",\"no\")","v":""}]
["E1.1","Has the statement of financial position been prepared in accordance with the format shown under FReM 5.4.13?",null,null,"FReM 5.4.13"]
[null,"Note (1): preparation of the statement of financial position in accordance with the format shown under FReM 5.4.13 will meet the requirement of IAS 1.60 to classify separately current and non-current assets, and current and non-current liabilities, in the statement of financial position (subject to the criteria set out in IAS 1.66 - 1.76 (see E1.5 - E1.8)).",null,null,"IAS 1.60"]
{"$rows_left_out":1328}
{"sheet":"F - SoCF","index":7,"n_rows":92,"n_cols":13,"rows_kept":92,"cut":false,"hidden":false,"merged":[]}
[null,{"$f":"'B - Presentation & Policies'!B1","v":"FReM DISCLOSURE GUIDE 2011-12"},"Subsection applicable?","Response","Ref","Comments/links",null,null,null,null,null,null,"yes"]
[null,"SECTION F: STATEMENT OF CASH FLOWS",null,{"$f":"IF((AND(D3<>\"no\",D6<>\"no\",D11<>\"no\",D25<>\"no\",D49<>\"no\",D53<>\"no\",D61<>\"no\",D64<>\"no\",D66<>\"no\",D68<>\"no\",D80<>\"no\",D85<>\"no\")),\"\",\"no\")","v":""},null,null,null,null,null,null,null,null,"no"]
[null,"General",null,{"$f":"IF((AND(D4<>\"no\",D5<>\"no\")),\"\",\"no\")","v":""}]
["F1.1","Has a statement of cash flows been presented as an integral part of the entity's financial statements for the period? ",null,null,"IAS 7.1"]
["F1.2","For departments and executive agencies, have the notes to the statement of cash flows been placed within the notes to the financial statements, and not in the statement of cash flows?",null,null,"FReM 5.4.21 c)"]
[null,"Presentation of a statement of cash flows",null,{"$f":"IF((AND(D7<>\"no\")),\"\",\"no\")","v":""}]
{"$rows_left_out":87}
{"sheet":"G - SoC in TE","index":8,"n_rows":25,"n_cols":6,"rows_kept":25,"cut":false,"hidden":false,"merged":[]}
[null,{"$f":"'B - Presentation & Policies'!B1","v":"FReM DISCLOSURE GUIDE 2011-12"},"X","Response","Ref","Comments/links"]
[null,"SECTION G: STATEMENT OF CHANGES IN TAXPAYERS' EQUITY",null,{"$f":"IF((AND(D5<>\"no\",D16<>\"no\",D19<>\"no\",D20<>\"no\",D22<>\"no\",D24<>\"no\")),\"\",\"no\")","v":""}]
[null,"Note (1): IAS 1 requires the preparation of a statement of changes in equity, which the FReM interprets as a statement of changes in taxpayers' equity, which should follow the format in IAS 1. Entities funded from Vote or grant-in-aid will need to adapt the format to accommodate this funding. Department Yellow, NDPB Green and Agency Pink proforma financial statements provide illustrative examples.",null,null,"IAS 1.10 (b) and 1. 81\nFReM 5.4.15"]
[null,"Note (2): other comprehensive income comprises items of income and expense (including reclassification adjustments) that are not recognised in profit or loss as required or permitted by other IFRSs, and include:\n    (a) changes in revaluation surplus (see IAS 16 Property, Plant \n          and Equipment and IAS 38 Intangible Assets);\n    (b) actuarial gains and losses on defined benefit plans \n         recognised in accordance with IAS 19.93A Employee Benefits;\n    (c) gains and losses arising from translating the financial \n         statements of a foreign operation (see IAS 21 The Effects of \n         Changes in Foreign Exchange Rates);\n    (d) gains and losses on remeasuring available-for-sale financial \n         assets (see IAS 39 Financial Instruments: Recognition and \n         Measurement);\n    (e) the effective portion of gains and losses on hedging \n         instruments in a cash flow hedge (see IAS 39).",null,null,"IAS 1.7"]
["G1.1","Have the following items been separately disclosed in the statement of changes in taxpayers' equity:",null,{"$f":"IF((AND(D6<>\"no\",D7<>\"no\",D9<>\"no\",D10<>\"no\",D11<>\"no\",D12<>\"no\",D13<>\"no\",D14<>\"no\")),\"\",\"no\")","v":""}]
[null,"(a) the profit or loss for the period?",null,null,"IAS 1.81"]
{"$rows_left_out":20}
{"sheet":"H - Notes","index":9,"n_rows":286,"n_cols":13,"rows_kept":286,"cut":false,"hidden":false,"merged":[]}
[null,{"$f":"'B - Presentation & Policies'!B1","v":"FReM DISCLOSURE GUIDE 2011-12"},"Subsection applicable?","Response","Ref","Comments/links",null,null,null,null,null,null,"yes"]
[null,"SECTION H:  NOTES TO THE FINANCIAL STATEMENTS",null,{"$f":"IF((AND(D4<>\"no\",D11<>\"no\",D102<>\"no\",D117<>\"no\",D192<>\"no\",D209<>\"no\",D221<>\"no\",D271<>\"no\",D146<>\"no\")),\"\",\"no\")","v":""},null,null,null,null,null,null,null,null,"no"]
[null,"Note: this section deals with notes that are additional to those required as set out in the SoCNE and SoFP sections."]
["H1","GENERAL   ",null,{"$f":"IF((AND(D5<>\"no\",D6<>\"no\",D7<>\"no\",D8<>\"no\",D9<>\"no\")),\"\",\"no\")","v":""}]
["H1.1","Has information about the basis of preparation of the financial statements and the specific accounting policies used been disclosed in accordance with IAS 1.117 - 1.124 (see B7.1 - B7.2) in the notes to the financial statements?",null,null,"IAS 1.112 (a)"]
["H1.2","Has information required by IFRSs that is not presented elsewhere in the financial statements been disclosed in the notes to the financial statements?",null,null,"FReM 5.4.34\nIAS 1.112 (b)"]
{"$rows_left_out":281}
{"sheet":"I - Consolidated FS","index":10,"n_rows":123,"n_cols":13,"rows_kept":123,"cut":false,"hidden":false,"merged":[]}
[null,{"$f":"'B - Presentation & Policies'!B1","v":"FReM DISCLOSURE GUIDE 2011-12"},"Subsection applicable?","Response","Ref","Comments/links",null,null,null,null,null,null,"yes"]
[null,"SECTION I: CONSOLIDATED FINANCIAL STATEMENTS (INCLUDING ASSOCIATES AND JOINT VENTURES) ",null,{"$f":"IF((AND(D4<>\"no\",D101<>\"no\")),\"\",\"no\")","v":""},null,null,null,null,null,null,null,null,"no"]
[null,"Note: IAS 27 Consolidated and Separate Financial Statements, IAS 28 Investments in Associates and IAS 31 Investments in Joint Ventures apply to all entities covered by the FReM except that for departments, the entities to be accounted for as subsidiaries, associates or joint ventures differ from those prescribed by the IFRSs. The applicability of IASs 27, 28 and 31 to departmental resource accounts is set out in FReM 4.2.2 - 4.2.5, and 4.2.12 - 4.2.13 (see B2.19).",null,null,"FReM 4.2.2 - 4.2.5 and 4.2.12 - 4.2.13"]
["I1","CONSOLIDATED FINANCIAL STATEMENTS ",null,{"$f":"IF((AND(D5<>\"no\",D25<>\"no\",D55<>\"no\",D78<>\"no\",D99<>\"no\")),\"\",\"no\")","v":""}]
[null,"Presentation of consolidated financial statements",null,{"$f":"IF((AND(D6<>\"no\",D8<>\"no\",D17<>\"no\",D20<>\"no\",D23<>\"no\")),\"\",\"no\")","v":""}]
["I1.1","Where the entity is a parent entity (except where it is a parent entity as described in IAS 27.10), have consolidated financial statements been presented?",null,null,"IAS 27.9"]
{"$rows_left_out":118}
{"sheet":"J - Bus Comb","index":11,"n_rows":81,"n_cols":13,"rows_kept":81,"cut":false,"hidden":false,"merged":[]}
[null,{"$f":"'B - Presentation & Policies'!B1","v":"FReM DISCLOSURE GUIDE 2011-12"},"Subsection applicable?","Response","Ref","Comments/links",null,null,null,null,null,null,"yes"]
[null,"SECTION J: BUSINESS COMBINATIONS",null,{"$f":"IF((AND(D5<>\"no\",D58<>\"no\",D80<>\"no\")),\"\",\"no\")","v":""},null,null,null,null,null,null,null,null,"no"]
[null,"Note (1): whether a transaction or other event is a business combination should be determined by applying the definition in IFRS 3, which requires that the assets acquired and liabilities assumed constitute a business.",null,null,"IFRS 3.3"]
[null,"Note (2): where a business combination (an acquisition or merger) is part of machinery of government changes, the accounting and disclosure requirements of FReM 4.2.21 - 4.2.22 should be followed (see B2.22). IFRS 3 should be applied to all combinations involving an entity or entities within the public sector with an entity outside the sector.",null,null,"FReM 4.2.15 and 16"]
[null,"The nature and financial effect of business combinations effected during the period and after the reporting period",null,{"$f":"IF((AND(D6<>\"no\",D52<>\"no\",D55<>\"no\")),\"\",\"no\")","v":""}]
["J1.1","Has information been disclosed that enables users of the financial statements to evaluate the nature and financial effect of business combinations that were effected during the current reporting period and after the end of the reporting period but before the financial statements are authorised for issue, including the following information for each business combination:",null,{"$f":"IF((AND(D7<>\"no\",D8<>\"no\",D9<>\"no\",D10<>\"no\",D11<>\"no\",D12<>\"no\",D17<>\"no\",D22<>\"no\",D26<>\"no\",D27<>\"no\",D28<>\"no\",D31<>\"no\",D32<>\"no\",D40<>\"no\",D43<>\"no\",D46<>\"no\",D49<>\"no\",D50<>\"no\")),\"\",\"no\")","v":""},"IFRS 3.59 and 3.60"]
{"$rows_left_out":76}
{"sheet":"K - Interim Reports","index":12,"n_rows":63,"n_cols":6,"rows_kept":63,"cut":false,"hidden":false,"merged":[]}
[null,{"$f":"'B - Presentation & Policies'!B1","v":"FReM DISCLOSURE GUIDE 2011-12"},"X","Response","Ref","Comments/links"]
[null,"SECTION K: INTERIM FINANCIAL REPORTING",null,{"$f":"IF((AND(D4<>\"no\",D13<>\"no\",D22<>\"no\",D49<>\"no\",D52<>\"no\",D59<>\"no\",D61<>\"no\")),\"\",\"no\")","v":""}]
[null,"Note: IAS 34 Interim Financial Reporting applies in full to those reporting entities that are required or elect to publish interim financial reports.  ",null,null,"FReM 5.1.8"]
[null,"Minimum components of an interim financial report",null,{"$f":"IF((AND(D5<>\"no\")),\"\",\"no\")","v":""}]
["K1.1","Have the following components been included, at a minimum, in interim financial report:",null,{"$f":"IF((AND(D6<>\"no\",D7<>\"no\",D9<>\"no\",D10<>\"no\",D11<>\"no\")),\"\",\"no\")","v":""}]
[null,"(a) condensed statement of financial position?",null,null,"IAS 34.8 (a)"]
{"$rows_left_out":58}
{"sheet":"L - Summary FS","index":13,"n_rows":46,"n_cols":6,"rows_kept":46,"cut":false,"hidden":false,"merged":[]}
[null,{"$f":"'B - Presentation & Policies'!B1","v":"FReM DISCLOSURE GUIDE 2011-12"},"X","Response","Ref","Comments/links"]
[null,"SECTION L: SUMMARY FINANCIAL STATEMENTS",null,{"$f":"IF((AND(D4<>\"no\",D7<>\"no\",D8<>\"no\",D11<>\"no\",D25<>\"no\",D29<>\"no\",D31<>\"no\",D32<>\"no\",D35<>\"no\",D34<>\"no\")),\"\",\"no\")","v":""}]
[null,"Note: a reporting entity that wishes to publish a document additional to its annual report and accounts that contains summary financial information should comply with the requirements of sections 426 and 428 of the Companies Act 2006. The summary data must not be published in advance of the full annual report and accounts being laid before Parliament as to do so would be a breach of Parliamentary privilege.",null,null,"FReM 5.1.7\nCA § 426"]
["L1.1","Has a statement been included in a prominent position to the effect that:",null,{"$f":"IF((AND(D5<>\"no\",D6<>\"no\")),\"\",\"no\")","v":""},"SI 2008/374 regs 9 (3) and (4)","     "]
[null,"(a) the summary financial statement does not contain sufficient information to allow as full an understanding of the results and state of affairs of the entity, and of their policies and arrangements concerning directors' remuneration (where appropriate) as would be provided by the full annual accounts and reports?"]
[null,"(b) readers requiring more detailed information have the right to obtain, free of charge, a copy of the entity’s last full accounts and reports?"]
{"$rows_left_out":41}
{"sheet":"List of IFRSs","index":14,"n_rows":76,"n_cols":10,"rows_kept":76,"cut":false,"hidden":false,"merged":[]}
[null,{"$f":"'B - Presentation & Policies'!B1","v":"FReM DISCLOSURE GUIDE 2011-12"},null,null,null,null,null,null,null,"yes"]
[null,"LIST OF IFRSs IN FORCE ",null,null,null,null,null,null,null,"no"]
[]
["IAS "]
[1,"Presentation of Financial Statements (Revised 2007)"]
[2,"Inventories"]
{"$rows_left_out":71}
{"sheet":"List of abbreviations","index":15,"n_rows":34,"n_cols":3,"rows_kept":34,"cut":false,"hidden":false,"merged":[]}
[]
[null,null,"ABBREVIATIONS and LINKS"]
[null,null,"(Note: some links are external to Merlin and so will only work if you are networked)"]
[null,null,"The following abbreviations are used principally in the \"Ref\" column of this spreadsheet"]
[null,"AC","Audit Circular"]
[null,"AP","\"Agency Pink\" illustrative accounts pro forma"]
{"$rows_left_out":28}