{"text_format":"1","workbook":"xlsx","n_sheets":9,"sheets":["Summary","Combined","Checklist","FReM prescriptiveness","ALB information","Disclosure of interests","Off-payroll tables","TUFT tables","Link libraries"],"not_rendered":{"charts":0,"images":1,"macros":1,"external_links":1,"defined_names":4,"comments":2,"pivot_tables":0},"unopened":[],"bounds":{"document_bytes":16777216,"sheet_cells":100000,"rows_first":2000,"rows_last":500,"rows_between":2000,"halvings":0,"cell_chars":16384,"cell_head_chars":4096},"cells_cut":0,"cells_raw":0,"read":"whole","date_system":"1900"}

{"sheet":"Summary","index":0,"n_rows":24,"n_cols":20,"rows_kept":24,"cut":false,"hidden":false,"merged":[[3,3,3,6],[4,3,4,6],[5,3,5,6],[9,4,10,4]]}
[null,null,null,"FReM Annual Report Disclosure Guide 2023-24",null,null,null,null,null,null,null,null,null,null,null,null,"Yes"]
[null,null,null,"Instructions",null,null,null,null,null,null,null,null,null,null,null,null,"No",null,null,"Yes"]
[null,null,null,"PLEASE NOTE THAT THIS CHECKLIST REQUIRES MACROS TO BE ENABLED."]
[null,null,null,"Please consider the questions for the entity you are auditing in column D and complete column E with your answers. ",null,null,null,null,null,null,null,null,null,null,null,null,"Not material"]
[null,null,null,"Pressing the \"Generate Checklist\" button will generate a tailored checklist based on your responses. Please then save."]
[null,null,null,"If you later require disclosure requirements for additional sections, open a new checklist and select only the newly required elements as \"Yes\". You can then copy and paste the newly rows to the bottom of the main checklist."]
[]
[null,null,null,"Additional information:"]
[null,null,null,"There is a separate checklist for the financial statements.","KEY:"]
[null,null,null,"This checklist is designed for FReM based accounts.","New or substantially updated requirements"]
[null,null,null,"For further information on any disclosure, follow the reference to the original guidance."]
[]
[null,null,null,"Question","Applicable?","Comments","Guidance"]
[null,"Required",null,"All required sections to be included?","Yes",null,"Only amend this answer if you are producing a second version of the checklist and require specific sections only."]
[null,"Department",null,"Is the entity a Department?"]
[null,"Corporate Governance Code",null,"Is the entity a Ministerial Department that is required to comply with the Corporate governance in central government departments: code of good practice 2011 (revised 2017)?"]
[null,"SDP",null,"Is the entity required to report on priority outcomes agreed at the Spending Review (an Outcome Delivery Plan)?"]
[null,"Summary FS",null,"Does the entity intend to publish a document additional to its annual report and accounts containing supplementary material including summary financial statements?"]
[null,"D&I",null,"Does the entity intend to publish best practice disclosures on diversity and inclusion?\n\nSee FReM 6.5.17"]
[null,"Union",null,"Is the entity required to publish Trade Union Facility Time - under Statutory Instrument 2017 No. 328 - i.e. all departments and a further 191 defined entities that have a full-time employer number above 49?",null,null,"http://www.legislation.gov.uk/uksi/2017/328/made"]
{"$rows_left_out":5}
{"sheet":"Combined","index":1,"n_rows":245,"n_cols":13,"rows_kept":245,"cut":false,"hidden":true,"merged":[[2,2,2,4],[12,2,12,4],[124,2,124,4],[9,2,9,4]]}
["Tag 1",null,"Area","Ref","FReM Annual Report Disclosure Guide 2023-24","x","Response","FReM / PES references","FReM links","Additional references","Comments/links","LOOKUP","Ty[e"]
[null,null,null,null,null,null,null,null,null,null,"Users are encouraged to provide a link or page reference to where the disclosure is included in the accounts to help reviewers.  We also suggest that this column is used to document assessments / explanations supporting judgments that a disclosure is immaterial or is not relevant. ","Yes"]
["Required",null,"General requirements",null,null,null,null,null,null,null,null,"Yes"]
["Required","P","Scope",1,"Where the entity is a parent entity, and group or consolidated accounts are prepared, has a consolidated annual report relating to the undertakings included in the consolidation been prepared? ",null,null,"FReM 4.3.1",{"$f":"IF(ISBLANK(H4),\"\",HYPERLINK(INDEX('Link libraries'!$B:$E,MATCH(H4,'Link libraries'!$B:$B,0),4),H4))","v":"FReM 4.3.1"},null,null,{"$f":"VLOOKUP(A4,Summary!$B$13:$E$24,4,FALSE)","v":"Yes"}]
["Required","P","Scope",2,"Is the Annual Report fair, balanced and understandable?\n\nNote: The FReM requirement for the annual report and accounts to be fair, balanced and understandable refers to the two fundamental qualitative characteristics of useful financial information included in the IFRS Conceptual Framework: relevance; and faithful representation\n- Relevant financial information is capable of making a difference in the decisions made by users, and may have predictive value, confirmatory value, or both.\n- A faithful representation is, to the maximum extent possible, complete, neutral and free from error.",null,null,"FReM 2.3.4",{"$f":"IF(ISBLANK(H5),\"\",HYPERLINK(INDEX('Link libraries'!$B:$E,MATCH(H5,'Link libraries'!$B:$B,0),4),H5))","v":"FReM 2.3.4"},null,null,{"$f":"VLOOKUP(A5,Summary!$B$13:$E$24,4,FALSE)","v":"Yes"}]
["Required","P","Annual Report Structure",3,"Does the annual report contain the following two sections?\na) The Performance Report\nb) The Accountability Report, including (where relevant) the Statement of Outturn against Parliamentary Supply (SOPS)",null,null,"FReM 4.1.4",{"$f":"IF(ISBLANK(H6),\"\",HYPERLINK(INDEX('Link libraries'!$B:$E,MATCH(H6,'Link libraries'!$B:$B,0),4),H6))","v":"FReM 4.1.4"},null,null,{"$f":"VLOOKUP(A6,Summary!$B$13:$E$24,4,FALSE)","v":"Yes"}]
["Department","P","Lead Non-Executive’s Report",4,"For Departments with an enhanced departmental board, is there a section written by the entity's Lead Non-Executive, included either within the Accountability Report or in the Performance Overview immediately following the Minister's/Chief Executive's statement? ",null,null,"PES (2024) 01 20.1-20.3",null,{"$f":"H7","v":"PES (2024) 01 20.1-20.3"},null,"Yes"]
["Department","P","Front cover",5,"Does the Annual Report and Accounts document have a front cover which includes the department's proper name and the document title (which must match the title page)?\n\nNote: The HC number may be included in the bottom left-hand corner.",null,null,"PES (2024) 01 44.1(a)",null,"PES (2024) 01 44.1(a)",null,{"$f":"VLOOKUP(A8,Summary!$B$13:$E$24,4,FALSE)","v":0}]
["Department","P","Contents page",6,"Does the Annual Report and Accounts document have a contents page (generally page 3), which is not normally combined with other information?",null,null,"PES (2024) 01 44.1(c)",null,null,null,{"$f":"VLOOKUP(A9,Summary!$B$13:$E$24,4,FALSE)","v":0}]
["Required",null,"Title page",null,null,null,null,null,null,null,null,"Yes"]
["Department","P","Title page\n\nNEW 2023-24",7,"Does the Annual Report and Accounts document have a title page (page 1) which contains the following information?\na) The full title of the paper, the statutory name (rather than an abbreviation) of the organisation, and the period covered by the accounts.\n\nb) The words “Ordered by the House of Commons to be printed on” and the date of laying (in full: date month year). If the date of laying changes late in the publishing process, the title page must be updated accordingly to show the correct date.\n\nc) The House of Commons series number, towards the bottom left of the title page, and in a size no smaller than 10-point font (ideally 12-point or larger); the number should be preceded by the abbreviation “HC”. Ideally, this number should also appear on the front cover of the document.\n\nd) The legislation or authority under which the paper is being laid in each House. References to laying legislation should be written out in full e.g., for Annual Reports and Accounts laying solely under Government Resources and Accounts Act 2000: \n“Accounts presented to the House of Commons pursuant to Section [normally 6(4)] of the Government Resources and Accounts Act 2000\nAnnual Report presented to the House of Commons by Command of His Majesty”\n\ne) If the accounts are laid by another Act, or if there is any variation to this, the presentation lines must cover what is being presented to each House and by which authority: e.g., for annual reports that are laid by Act: \n“Annual Report presented to Parliament pursuant to [Insert relevant Section] of the [insert name of relevant Act] Act [insert year of Act]\nAccounts presented to the House of Commons pursuant to Section 6(4) of the Government Resources and Accounts Act 2000”\nAccounts presented to the House of Lords by Command of His Majesty”\n\nf) For Pension Scheme accounts, which are not required to include an annual report, the presentation line should be: “Presented to the House of Commons pursuant to Section 6(4) of the Government Resources and Accounts Act 2000”\n\ng) If the entity has, unusually, chosen to lay the Annual Report and Accounts in the House of Lords when not required to do so, the following line should also be added: “Annual Report and Accounts presented to the House of Lords by Command of His Majesty”",null,null,"PES (2024) 01 42.1",null,"PES (2024) 01 42.1",null,{"$f":"VLOOKUP(A11,Summary!$B$13:$E$24,4,FALSE)","v":0}]
["Department","P","Title page\n\nNEW 2023-24",8,"Does the title version page (page 2)  contain thefollowing information?\na) A statement on departmental publications for the year: “This is part of a series of departmental publications which, along with the Main Estimates 2024-25 and the document Public Expenditure: Statistical Analyses 2024, present the government’s outturn for 2023-24 and planned expenditure for 2024-25.”\n\nc) 'Copyright re-use' statement, including the year of publication. The current Crown statement will be supplied by the framework supplier as part of its production service to departments. The statements are also available on The National Archives' website.\n\nd) Open Government Licence symbol to appear directly above the copyright re-use statement (for Crown copyright publications). The symbol is provided as part of the Crown statement above.\n\ne) The document’s ISBN and HH Global E number, to appear below the copyright statement.\n\nf) Department’s contact details.\n\ng) 'Recycled paper' statement.\n\nh) Any third-party copyright acknowledgements.\n\ni) 'Printed in the UK on behalf of His Majesty’s Stationary Office' statement.\n\nj) No images or colour fills.",null,null,"PES (2024) 01 43.1",null,"PES (2024) 01 43.1",null,{"$f":"VLOOKUP(A12,Summary!$B$13:$E$24,4,FALSE)","v":0}]
["Required","P","The Performance Report",null,null,null,null,null,null,null,null,"Yes"]
["Required","P","The Performance Report",9,"Does the Performance Report follow the prescribed structure?\nThe performance report should have two sections:\n- Performance overview\n- Performance analysis\n\nThe performance overview is a short summary of the full story of an organisation and its performance over the period covered by the report. The performance anlysis provides a detailed view.\n\nThe performance report should cover, but is not limited to: \na) a description of the entity and its group;\nb) how the entity is organised;\nc) what the entity's aims are;\nd) how the entity has performed and met its aims; \ne) any key risks to performance or meeting aims; and\ne) any future plans.\n\nIt should be straightforward and accessible, so that it can be easily understood by a lay user and contain cross-references to other parts of the annual report and accounts where relevant and appropriate. ",null,null,"FReM 5.1.2-5.1.3","FReM 5.1.2-5.1.3",null,null,"Yes"]
["Required","P","Performance Overview",10,"Does the performance overview provide sufficient information to enable understanding of: \na) the organisation;\nb) its purpose;\nc) the outcomes it is aiming to achieve;\nd) its objectives;\ne) its performance against delivering those outcomes; and \nf) both the impact of and management of key risks. \n\nNote: The performance overview should be short (no more than 10-15 pages), but enough for the lay user to have no need to look further into the rest of the annual report and accounts, unless they were interested in further detail or had specific accountability or decision-making needs.",null,null,"FReM 5.3.1",{"$f":"IF(ISBLANK(H15),\"\",HYPERLINK(INDEX('Link libraries'!$B:$E,MATCH(H15,'Link libraries'!$B:$B,0),4),H15))","v":"FReM 5.3.1"},null,null,{"$f":"VLOOKUP(A15,Summary!$B$13:$E$24,4,FALSE)","v":"Yes"}]
["Required","P","Performance Overview",11,"Does the Performance Overview section contain all of the following mandatory elements listed below:\na) A short summary explaining the purpose of the overview section; ",null,null,"FReM 5.3.3",{"$f":"IF(ISBLANK(H16),\"\",HYPERLINK(INDEX('Link libraries'!$B:$E,MATCH(H16,'Link libraries'!$B:$B,0),4),H16))","v":"FReM 5.3.3"},"FReM 5.3.3 (a)\nPES (2024) 01 10.2",null,{"$f":"VLOOKUP(A16,Summary!$B$13:$E$24,4,FALSE)","v":"Yes"}]
["Required","P","Performance Overview",12,"b) A statement from the entity’s lead Minister or Chief Executive providing their perspective on the performance of the organisation over the period;",null,null,"FReM 5.3.3",{"$f":"IF(ISBLANK(H17),\"\",HYPERLINK(INDEX('Link libraries'!$B:$E,MATCH(H17,'Link libraries'!$B:$B,0),4),H17))","v":"FReM 5.3.3"},"FReM 5.3.3 (b)\nPES (2024) 01 10.2",null,{"$f":"VLOOKUP(A17,Summary!$B$13:$E$24,4,FALSE)","v":"Yes"}]
["Required","P","Performance Overview",13,"c) A statement of the purpose and activities of the organisation, including a brief description of the business model and environment.",null,null,"FReM 5.3.3",{"$f":"IF(ISBLANK(H18),\"\",HYPERLINK(INDEX('Link libraries'!$B:$E,MATCH(H18,'Link libraries'!$B:$B,0),4),H18))","v":"FReM 5.3.3"},"FReM 5.3.3 (c)\nPES (2024) 01 10.2",null,{"$f":"VLOOKUP(A18,Summary!$B$13:$E$24,4,FALSE)","v":"Yes"}]
["Required","P","Performance Overview",14,"d) A brief description or diagram detailing organisational structure, if not already included as a result of the above requirements.",null,null,"FReM 5.3.3",{"$f":"IF(ISBLANK(H19),\"\",HYPERLINK(INDEX('Link libraries'!$B:$E,MATCH(H19,'Link libraries'!$B:$B,0),4),H19))","v":"FReM 5.3.3"},"FReM 5.3.3 (d)\nPES (2024) 01 10.2",null,{"$f":"VLOOKUP(A19,Summary!$B$13:$E$24,4,FALSE)","v":"Yes"}]
["Required","P","Performance Overview",15,"e) A summary of priority outcomes agreed at the latest Spending Review (SR), other strategic objectives the organisation has been working towards, and details of relevant enabling work taking place within the organisation to achieve said objectives.",null,null,"FReM 5.3.3",{"$f":"IF(ISBLANK(H20),\"\",HYPERLINK(INDEX('Link libraries'!$B:$E,MATCH(H20,'Link libraries'!$B:$B,0),4),H20))","v":"FReM 5.3.3"},"FReM 5.3.3 (e)\nPES (2024) 01 10.2",null,{"$f":"VLOOKUP(A20,Summary!$B$13:$E$24,4,FALSE)","v":"Yes"}]
{"$rows_left_out":226}
{"sheet":"Checklist","index":2,"n_rows":0,"n_cols":0,"rows_kept":0,"cut":false,"hidden":false,"merged":[]}

{"sheet":"FReM prescriptiveness","index":3,"n_rows":2,"n_cols":1,"rows_kept":2,"cut":false,"hidden":false,"merged":[]}
["Levels of prescriptiveness in financial reporting guidance"]
["FReM 2023-24 1.4.4 Figure 1"]

{"sheet":"ALB information","index":4,"n_rows":20,"n_cols":9,"rows_kept":20,"cut":false,"hidden":false,"merged":[[15,0,15,7],[19,0,19,7],[16,0,16,7],[11,0,11,7],[13,0,13,7],[12,0,12,7],[14,0,14,7],[17,0,17,7],[18,0,18,7],[3,1,4,1],[3,2,4,2],[3,3,4,3],[3,4,3,5],[3,6,3,7]]}
["Recommended layout for reporting disaggregated information on arm's-length bodies"]
["PES (2024) 01 16.4, 17.5, 18.2, 18.3, 19.3"]
[null,null,null,null,null,null,null,null,"Response"]
[null,"Total operating\n income\n[see Note 1 below]","Total operating \nexpenditure\n[see Note 2 below]","Net Expenditure for the year \n(including financing) [see Note 3 below]","Permanently employed staff ",null,"Other staff "]
[null,null,null,null,"Number of employees ","Staff costs ","Number of employees ","Staff costs "]
["Department "]
["ALB 1"]
["ALB 2 "]
["...."]
["ALB n"]
[]
["Note 1: Total operating income is calculated to include revenue from contracts with customers and other operating income. "]
[]
["Note 2: Total operating expenditure is calculated to include staff costs, purchase of goods and services, depreciation and impairment charges, provision expense and other operating expenditure."]
[]
["Note 3: Net expenditure for the year is calculated as total operating income, less total operating expenditure, plus finance income, less finance expense. "]
[]
["Where more detailed information on staff numbers and costs is readily available across all consolidated entities, departments are also encouraged to include further information which may be helpful for the user of the ARAs such as a breakdown by each ALB of staff numbers and/or costs by regional location and staff numbers by Full Time Equivalent etc."]
[]
["The department may choose to include a caveat to the Annex explaining that all tabled information was correct and accurate as at the approval date of the accompanying Annual Report and Accounts."]
{"$rows_left_out":1}
{"sheet":"Disclosure of interests","index":5,"n_rows":36,"n_cols":5,"rows_kept":36,"cut":false,"hidden":false,"merged":[[35,0,39,1],[2,0,2,3],[20,0,24,2],[3,0,4,3],[6,0,6,3]]}
["Example template for disclosure of interests of board members under the Corporate governance in central government departments: code of good practice"]
["PES (2024) 01 24.3"]
["The board should publish, in its governance statement, all relevant interests of individual board members and how any identified conflicts, and potential conflicts, of interest of board members have been managed."]
["Where a department’s existing Register of Interests meets the minimum requirements, the department should continue using their own; providing a web link where the register is included on their website (refer to FReM, para 4.3)."]
[]
[]
["Reporting entities must explain any non-compliance with the management of interest’s section of The Code."]
[null,null,null,null,"Response"]
["Name of company or organisation ","Position held ","Type of interest e.g. pay, fees, shareholding,  ","Other relevant information"]
["X","X","X","X"]
["X","X","X","X"]
["X","X","X","X"]
["X","X","X","X"]
["X","X","X","X"]
[]
[]
[]
["Required format for disclosure of interests of special advisors where there are interests to publish"]
["PES (2024) 01 27.3"]
[]
{"$rows_left_out":17}
{"sheet":"Off-payroll tables","index":6,"n_rows":33,"n_cols":5,"rows_kept":33,"cut":false,"hidden":false,"merged":[]}
["Required format for off-payroll tables",null,null,null,"Response"]
["Source: FReM 2023-24 Sections 6.5.39 - 6.5.42"]
[]
["Table 1: Highly paid off-payroll worker engagements as at 31 March 2024, earning £245 per day or greater.","Source: FReM 2023-24 6.5.39"]
[null,"Core Department","ALBs","Departmental group"]
["No. of existing engagements as of 31 March 2024","X","X","X"]
["Of which..."]
["No. that have existed for less than one year at time of reporting.","X","X","X"]
["No. that have existed for between one and two years at time of reporting.","X","X","X"]
["No. that have existed for between two and three years at time of reporting.","X","X","X"]
["No. that have existed for between three and four years at time of reporting.","X","X","X"]
["No. that have existed for four or more years at time of reporting.","X","X","X"]
[]
["Table 2: All highly paid off-payroll workers engaged at any point during the year ended 31 March 2024, earning £245 per day or greater.","Source: FReM 2023-24 6.5.40"]
[null,"Core Department","ALBs","Departmental group"]
["No. of temporary off-payroll workers engaged during the year ended 31 March 2024","X","X","X"]
["Of which..."]
["Not subject to off-payroll legislation","X","X","X"]
["Subject to off-payroll legislation and determined as in-scope of IR35","X","X","X"]
["Subject to off-payroll legislation and determined as out-of-scope of IR35","X","X","X"]
{"$rows_left_out":14}
{"sheet":"TUFT tables","index":7,"n_rows":30,"n_cols":3,"rows_kept":30,"cut":false,"hidden":false,"merged":[]}
["Required format for Trade Union Facility Time tables"]
["Source: Schedule 2 to the Trade Union (Facility Time Publication Requirements) Regulations 2017",null,"Response"]
[]
["Table 1"]
["Relevant union officials"]
["What was the total number of your employees who were relevant union officials during the relevant period?"]
["Number of employees who were relevant union officials during the relevant period","Full-time equivalent employee number"]
["X","X"]
[]
["Table 2"]
["Percentage of time spent on facility time"]
["How many of your employees who were relevant union officials employed during the relevant period spent a) 0%, b) 1%-50%, c) 51%-99% or d) 100% of their working hours on facility time?"]
["Percentage of time","Number of employees"]
[0,"X"]
["1-50%","X"]
["51%-99%","X"]
[1,"X"]
[]
["Table 3"]
["Percentage of pay bill spent on facility time"]
{"$rows_left_out":11}
{"sheet":"Link libraries","index":8,"n_rows":73,"n_cols":13,"rows_kept":73,"cut":false,"hidden":true,"merged":[]}
[null,"FReM link library",null,null,null,null,null,null,null,null,"PES Guidance on preparation of annual reports and accounts - Link library"]
[null,null,null,null,"Last updated February 2024",null,null,null,null,null,null,null,"Last updated 10 March 2021"]
[null,"Reference",null,null,"URL of extant FReM",null,null,null,null,null,"Reference",null,"URL of extant PES"]
[null,null,null,null,"https://assets.publishing.service.gov.uk/media/657b03c8095987000d95e120/MASTER_FINAL_2023-24_FReM___1_.pdf"]
[null,null,null,null,null,null,null,null,null,null,"Section","Page","Combined URL"]
[null,"Section","Page","Actual page in PDF","Combined URL",null,null,null,null,null,"PES(2021) 01 1.1",5,{"$f":"$N$3&\"#page=\"&L6","v":"#page=5"}]
[null,"FReM 2.3.4",null,11,{"$f":"$E$4&\"#page=\"&D7","v":"https://assets.publishing.service.gov.uk/media/657b03c8095987000d95e120/MASTER_FINAL_2023-24_FReM___1_.pdf#page=11"},null,null,null,null,null,"PES(2021) 01 1.2",5,"#page=5"]
[null,"FReM 4.1.4",null,22,{"$f":"$E$4&\"#page=\"&D8","v":"https://assets.publishing.service.gov.uk/media/657b03c8095987000d95e120/MASTER_FINAL_2023-24_FReM___1_.pdf#page=22"},null,null,null,null,null,"PES(2021) 01 1.3",5,"#page=5"]
[null,"FReM 4.3.1",null,26,"https://assets.publishing.service.gov.uk/media/657b03c8095987000d95e120/MASTER_FINAL_2023-24_FReM___1_.pdf#page=26",null,null,null,null,null,"PES(2021) 01 1.4",5,"#page=5"]
[null,"FReM 4.4.12",null,28,"https://assets.publishing.service.gov.uk/media/657b03c8095987000d95e120/MASTER_FINAL_2023-24_FReM___1_.pdf#page=28",null,null,null,null,null,"PES(2021) 01 1.5",5,"#page=5"]
[null,"FReM 5.1.2-5.1.3",null,31,"https://assets.publishing.service.gov.uk/media/657b03c8095987000d95e120/MASTER_FINAL_2023-24_FReM___1_.pdf#page=31",null,null,null,null,null,"PES(2021) 01 3.1",7,"#page=7"]
[null,"FReM 5.2.7",null,32,"https://assets.publishing.service.gov.uk/media/657b03c8095987000d95e120/MASTER_FINAL_2023-24_FReM___1_.pdf#page=32",null,null,null,null,null,"PES(2021) 01 4.5",9,"#page=9"]
[null,"FReM 5.3.1",null,32,"https://assets.publishing.service.gov.uk/media/657b03c8095987000d95e120/MASTER_FINAL_2023-24_FReM___1_.pdf#page=32",null,null,null,null,null,"PES(2021) 01 8.1",15,"#page=15"]
[null,"FReM 5.3.3",null,33,"https://assets.publishing.service.gov.uk/media/657b03c8095987000d95e120/MASTER_FINAL_2023-24_FReM___1_.pdf#page=33",null,null,null,null,null,"PES(2021) 01 12.3",17,"#page=17"]
[null,"FReM 5.4.10",null,38,"https://assets.publishing.service.gov.uk/media/657b03c8095987000d95e120/MASTER_FINAL_2023-24_FReM___1_.pdf#page=38",null,null,null,null,null,"PES(2021) 01   14.5",21,{"$f":"$N$3&\"#page=\"&L15","v":"#page=21"}]
[null,"FReM 5.4.11",null,39,"https://assets.publishing.service.gov.uk/media/657b03c8095987000d95e120/MASTER_FINAL_2023-24_FReM___1_.pdf#page=39",null,null,null,null,null,"PES(2021) 01   14.7",21,"#page=21"]
[null,"FReM 5.4.13",null,39,"https://assets.publishing.service.gov.uk/media/657b03c8095987000d95e120/MASTER_FINAL_2023-24_FReM___1_.pdf#page=39",null,null,null,null,null,"PES(2021) 01   14.8",21,"#page=21"]
[null,"FReM 5.4.14-5.4.16",null,39,"https://assets.publishing.service.gov.uk/media/657b03c8095987000d95e120/MASTER_FINAL_2023-24_FReM___1_.pdf#page=39",null,null,null,null,null,"PES(2021) 01   14.9",21,"#page=21"]
[null,"FReM 5.4.2",null,34,"https://assets.publishing.service.gov.uk/media/657b03c8095987000d95e120/MASTER_FINAL_2023-24_FReM___1_.pdf#page=34",null,null,null,null,null,"PES(2021) 01    18.3",26,"#page=26"]
[null,"FReM 5.4.3",null,34,"https://assets.publishing.service.gov.uk/media/657b03c8095987000d95e120/MASTER_FINAL_2023-24_FReM___1_.pdf#page=34",null,null,null,null,null,"PES(2021) 01    18.4",26,"#page=26"]
{"$rows_left_out":53}