{"text_format":"1","workbook":"xlsx","n_sheets":5,"sheets":["Summary","Combined","Checklist","List of abbreviations","Link library"],"not_rendered":{"charts":0,"images":1,"macros":1,"external_links":0,"defined_names":8,"comments":0,"pivot_tables":0},"unopened":[],"bounds":{"document_bytes":16777216,"sheet_cells":100000,"rows_first":2000,"rows_last":500,"rows_between":2000,"halvings":0,"cell_chars":16384,"cell_head_chars":4096},"cells_cut":0,"cells_raw":0,"read":"whole","date_system":"1900"}

{"sheet":"Summary","index":0,"n_rows":65,"n_cols":17,"rows_kept":65,"cut":false,"hidden":false,"merged":[[23,3,23,6],[9,4,10,4],[2,3,2,7],[3,3,3,7],[4,3,4,7],[5,3,5,7],[9,7,10,7]]}
[null,null,null,"FReM Financial Statements Disclosure Guide 2023-24",null,null,null,null,null,null,null,null,null,"Yes"]
[null,null,null,"Instructions",null,null,null,null,null,null,null,null,null,"No",null,null,"Yes"]
[null,null,null,"PLEASE NOTE THAT THIS CHECKLIST REQUIRES MACROS TO BE ENABLED.",null,null,null,null,null,null,null,null,null,"N/A",null,null,"No"]
[null,null,null,"Please answer the questions in column D for the entity you are auditing, and complete column E with your responses. "]
[null,null,null,"Pressing the \"Generate Checklist\" button will generate a tailored checklist based on your responses. Please then save."]
[null,null,null,"If you later require disclosure requirements for additional sections, open a new checklist and select only the newly required elements as \"Yes\". You can then copy and paste the newly rows to the bottom of the main checklist."]
[]
[null,null,null,"Additional information:"]
[null,null,null,"There is a separate checklist for the Annual Report.","KEY:"]
[null,null,null,"This checklist is designed for FReM based accounts.","New or substantially updated requirements"]
[null,null,null,"For further information on any disclosure, follow the reference to the original guidance."]
[]
[]
[null,null,null,"Question","Yes / No","Comments","Relevant standard","Guidance"]
[null,"Dept",null,"Is the entity a Department?",null,null,"N/A"]
[null,"Investment entities",null,"Is the entity an investment entity as defined by IFRS 10 B85A - B85M?",null,null,"IFRS 12"]
[null,"Subsidiary",null,"Is the entity a subsidiary?",null,null,"N/A"]
[null,"Trust Statements",null,"Does the entity collect revenue on behalf of the consolidated fund? (This includes taxes and duties, and fines and penalties)",null,null,"FReM"]
[null,"Required",null,"All required sections to be included?","Yes",null,"N/A","Only amend this answer if you are producing a second version of the checklist and require specific sections only."]
[null,"Consolidated FS",null,"Does the entity prepare consolidated financial statements?",null,null,"IFRS 12"]
{"$rows_left_out":46}
{"sheet":"Combined","index":1,"n_rows":755,"n_cols":22,"rows_kept":755,"cut":false,"hidden":true,"merged":[]}
["Tag 1",null,"Area","Ref","FReM Financial Statements Disclosure Guide 2023-24","x","Response","Ref","FReM reference","FReM links","Comments/links","LOOKUP",null,null,null,null,null,null,null,null,null,"Yes"]
[null,null,null,null,null,null,null,null,null,null,"Users are encouraged to provide a link or page reference to where the disclosure is included in the accounts to help reviewers.  We also suggest that this column is used to document assessments / explanations supporting judgments that a disclosure is immaterial or is not relevant. ","Yes"]
["Required",null,"PART 1: Requirements of IFRS in respect of the financial statements and associated notes",null,null,null,null,null,null,null,null,{"$f":"VLOOKUP(A3,Summary!$B$14:$E$71,4,FALSE)","v":"Yes"}]
["Required",null,"1.1: PRESENTATION OF FINANCIAL STATEMENTS AND ACCOUNTING POLICIES",null,null,null,null,null,null,null,null,{"$f":"VLOOKUP(A4,Summary!$B$14:$E$71,4,FALSE)","v":"Yes"}]
["Required","P","Complete set of financial statements","1.1.1","Have the following been included in the financial statements:\n(a) a statement of financial position as at the end of the period?\n",null,null,"IAS 1.10 (a)",null,null,null,{"$f":"VLOOKUP(A5,Summary!$B$14:$E$71,4,FALSE)","v":"Yes"}]
["Required","P","Complete set of financial statements","1.1.2","(b)  a statement of comprehensive net expenditure for the period?",null,null,"IAS 1.10 (b)",null,null,null,{"$f":"VLOOKUP(A6,Summary!$B$14:$E$71,4,FALSE)","v":"Yes"}]
["Required","P","Complete set of financial statements","1.1.3","(c) a statement of changes in taxpayers' equity for the period?",null,null,"IAS 1.10 (c)",null,null,null,{"$f":"VLOOKUP(A7,Summary!$B$14:$E$71,4,FALSE)","v":"Yes"}]
["Required","P","Complete set of financial statements","1.1.4","(d) a statement of cash flows for the period?\n",null,null,"IAS 1.10 (d)",null,null,null,{"$f":"VLOOKUP(A8,Summary!$B$14:$E$71,4,FALSE)","v":"Yes"}]
["Required","P","Complete set of financial statements\n\nAMENDED 2023-24","1.1.5","(e) notes comprising material accounting policies and other explanatory information?",null,null,"IAS 1.10(e)",null,null,null,{"$f":"VLOOKUP(A9,Summary!$B$14:$E$71,4,FALSE)","v":"Yes"}]
["Required","P","Complete set of financial statements","1.1.6","(f) where the entity applies an accounting policy retrospectively, makes a retrospective restatement of, or reclassifies, items in its financial statements, a statement of financial position as at the beginning of the preceding period? \n",null,null,"IAS 1.10 (f)",null,null,null,{"$f":"VLOOKUP(A10,Summary!$B$14:$E$71,4,FALSE)","v":"Yes"}]
["Required",null,"Fair presentation","1.1.7","Has the entity selected and applied accounting policies in accordance with IAS 8 and presented information, including accounting policies, in a manner that provides relevant, reliable, comparable and understandable information? \n\nNote: IAS 8 sets out a hierarchy of authoritative guidance that management considers in the absence of an IFRS that specifically applies to an item. \n\nFReM guidance: The Conceptual Framework also sets out the principles behind the technical concepts that form the basis for all IFRSs. The Standards interpret these principles into guidance, which takes precedence over the Conceptual Framework for entities preparing accounts. IAS 8 sets out this relationship and also provides guidance on when and how it is appropriate to refer back to the Framework to develop an accounting policy.",null,null,"IAS 1.17(a)-(b)",null,null,null,{"$f":"VLOOKUP(A11,Summary!$B$14:$E$71,4,FALSE)","v":"Yes"}]
["Required","P","Fair presentation","1.1.8","Have additional disclosures been provided where compliance with the specific requirements in IFRSs is insufficient to enable users to understand the impact of particular transactions, other events and conditions on the entity's financial position and financial performance?",null,null,"IAS 1.17(c)",null,null,null,{"$f":"VLOOKUP(A12,Summary!$B$14:$E$71,4,FALSE)","v":"Yes"}]
["Required",null,"Departures from IFRS","1.1.9","Where an entity departs from a requirement of an IFRS (extremely rare), have they disclosed:\n(a) that management has concluded that the financial statements give a true and fair view of the entity’s financial position, financial performance and cash flows?\n(b) that the entity has complied with applicable IFRSs, except that it has departed from a particular requirement to achieve a truthful and fair presentation?\n(c) the title of the IFRS from which the entity has departed, the nature of the departure, including the treatment that the IFRS would require, the reason why that treatment would be so misleading in the circumstances that it would conflict with the objective of financial statements set out in the Framework, and the treatment adopted?\n(d) the financial impact of the departure on each item in the financial statements that would have been reported in complying with the requirement for each period presented?",null,null,"\nIAS 1.20 \n",null,null,null,{"$f":"VLOOKUP(A13,Summary!$B$14:$E$71,4,FALSE)","v":"Yes"}]
["Required",null,"Departures from IFRS","1.1.10","Where an entity has departed from a requirement of an IFRS in a prior period, and that departure affects the amounts recognised in the financial statements for the current period, has the following been disclosed: \n(a) the title of the IFRS from which the entity has departed, the nature of the departure, including the treatment that the IFRS would require, the reason why that treatment would be so misleading in the circumstances that it would conflict with the objective of financial statements set out in the Framework, and the treatment adopted?\n(b) the financial impact of the departure on each item in the financial statements that would have been reported in complying with the requirement for each period presented?",null,null,"IAS 1.21",null,null,null,{"$f":"VLOOKUP(A14,Summary!$B$14:$E$71,4,FALSE)","v":"Yes"}]
["Required",null,"Departures from IFRS","1.1.11","Where management conclude that they should depart from an IFRS, but regulatory framework prohibits this, have they disclosed:\n(a) the title of the IFRS in question, the nature of the requirement, and the reason why management has concluded that complying with that requirement is so misleading in the circumstances that it conflicts with the objective of financial statements set out in the Framework?\n(b) for each period presented, the adjustments to each item in the financial statements that management has concluded would be necessary to achieve a truthful and fair presentation?",null,null,"IAS 1.23 ",null,null,null,{"$f":"VLOOKUP(A15,Summary!$B$14:$E$71,4,FALSE)","v":"Yes"}]
["Required",null,"Financial statements","1.1.12","Have the financial statements been clearly identified, and distinguished from other information in the same published document?",null,null,"IAS 1.49",null,null,null,{"$f":"VLOOKUP(A16,Summary!$B$14:$E$71,4,FALSE)","v":"Yes"}]
["Required",null,"Financial statements","1.1.13","Has each financial statement and note been clearly identified and given equal prominence? ",null,null,"IAS 1.51",null,null,null,{"$f":"VLOOKUP(A17,Summary!$B$14:$E$71,4,FALSE)","v":"Yes"}]
["Required",null,"Information about the entity and its reporting period","1.1.14","Has the following information been prominently displayed, and repeated where it is necessary for a proper understanding of the information presented:\n(a) the name of the reporting entity or other means of identification and any change in that information from the preceding reporting period?\n(b) whether the financial statements cover the individual entity or a group of entities?\n(c) the date of the end of the reporting period or the period covered by the set of financial statements or notes?\n(d) the presentation currency, as defined in IAS 21 The Effects of Changes in Foreign Exchange Rates?\n(e) the level of rounding used in the presentation of figures in the financial statements?",null,null,"IAS 1.51",null,null,null,{"$f":"VLOOKUP(A18,Summary!$B$14:$E$71,4,FALSE)","v":"Yes"}]
["Required",null,"Long and short accounting periods","1.1.15","When, in exceptional circumstances, the entity changes the end of its reporting period and presents financial statements for a period longer or shorter than one year, has the following been disclosed:\n(a) the period covered by the financial statements?\n(b) the reason for using a longer or shorter period?\n(c) the fact that amounts presented in the financial statements are not entirely comparable?",null,null,"IAS 1.36",null,null,null,{"$f":"VLOOKUP(A19,Summary!$B$14:$E$71,4,FALSE)","v":"Yes"}]
["Required",null,"Domicile, legal form and nature of the entity","1.1.16","Has the following been disclosed, either in the financial statements, or in information published with the financial statements: \n(a) the domicile and legal form of the entity, and its country of incorporation and the address of its registered office (or principal place of business, if different from the registered office);\n(b) a description of the nature of the entity’s operations and principal activities;\n(c) the name of the parent and the ultimate parent of the group; and\n(d) if it is a limited life entity, information regarding the length of its life?\n\nNote: If neither the entity's parent, nor the ultimate controlling party produces consolidated financial statements available for public use, the name of the next most senior parent that does should be disclosed under IAS 24.13. ",null,null,"IAS 1.138 (a)-(d) ",null,null,null,{"$f":"VLOOKUP(A20,Summary!$B$14:$E$71,4,FALSE)","v":"Yes"}]
{"$rows_left_out":736}
{"sheet":"Checklist","index":2,"n_rows":0,"n_cols":0,"rows_kept":0,"cut":false,"hidden":false,"merged":[]}

{"sheet":"List of abbreviations","index":3,"n_rows":34,"n_cols":3,"rows_kept":34,"cut":false,"hidden":false,"merged":[]}
[]
[null,null,"ABBREVIATIONS"]
[]
[null,null,"The following abbreviations are used principally in the references within the checklist."]
[null,"AC","Audit Circular"]
[null,"AP","\"Agency Pink\" illustrative accounts pro forma"]
[null,"CA","Companies Act 2006"]
[null,"CBG","Consolidated Budgeting Guidance "]
[null,"CFER","Consolidated Fund Extra Receipts"]
[null,"DY","\"Department Yellow\" illustrative resource account proforma"]
[null,"EM","Supply Estimates: a guidance manual"]
[null,"FReM","Government Financial Reporting Manual"]
[null,"GA","Government Accounting"]
[null,"GAAP","Generally Accepted Accounting Principles (or Practice)"]
[null,"IAS","International Accounting Standard"]
[null,"IFRIC","International Financial Reporting Interpretation Committee"]
[null,"IFRS","International Financial Reporting Standard"]
[null,"MPM","Managing Public Money"]
[null,"NDPB","Non-Departmental Public Body"]
[null,"NG","\"NDPB Green\" illustrative accounts pro forma"]
{"$rows_left_out":15}
{"sheet":"Link library","index":4,"n_rows":77,"n_cols":6,"rows_kept":77,"cut":false,"hidden":true,"merged":[]}
["Link library",null,null,null,null,"Last updated March 2024"]
[null,null,null,null,null,"URL of extant FReM"]
[null,null,"Reference",null,null,"https://assets.publishing.service.gov.uk/media/657b03c8095987000d95e120/MASTER_FINAL_2023-24_FReM___1_.pdf"]
[]
[null,null,"Section ","Numbered page","Actual page in the PDF","Combined URL"]
[null,null,"FReM 6.6.10",null,58,{"$f":"$F$3&\"#page=\"&E6","v":"https://assets.publishing.service.gov.uk/media/657b03c8095987000d95e120/MASTER_FINAL_2023-24_FReM___1_.pdf#page=58"}]
[null,null,"FReM 6.6.10",null,58,{"$f":"$F$3&\"#page=\"&E7","v":"https://assets.publishing.service.gov.uk/media/657b03c8095987000d95e120/MASTER_FINAL_2023-24_FReM___1_.pdf#page=58"}]
[null,null,"FReM 6.6.10",null,58,"https://assets.publishing.service.gov.uk/media/657b03c8095987000d95e120/MASTER_FINAL_2023-24_FReM___1_.pdf#page=58"]
[null,null,"FReM 6.6.12",null,58,"https://assets.publishing.service.gov.uk/media/657b03c8095987000d95e120/MASTER_FINAL_2023-24_FReM___1_.pdf#page=58"]
[null,null,"FReM 6.6.13",null,58,"https://assets.publishing.service.gov.uk/media/657b03c8095987000d95e120/MASTER_FINAL_2023-24_FReM___1_.pdf#page=58"]
[null,null,"FReM 6.6.13",null,58,"https://assets.publishing.service.gov.uk/media/657b03c8095987000d95e120/MASTER_FINAL_2023-24_FReM___1_.pdf#page=58"]
[null,null,"FReM 6.6.13",null,58,"https://assets.publishing.service.gov.uk/media/657b03c8095987000d95e120/MASTER_FINAL_2023-24_FReM___1_.pdf#page=58"]
[null,null,"FReM 6.6.14",null,58,"https://assets.publishing.service.gov.uk/media/657b03c8095987000d95e120/MASTER_FINAL_2023-24_FReM___1_.pdf#page=58"]
[null,null,"FReM 6.6.14",null,58,"https://assets.publishing.service.gov.uk/media/657b03c8095987000d95e120/MASTER_FINAL_2023-24_FReM___1_.pdf#page=58"]
[null,null,"FReM 6.6.14",null,58,"https://assets.publishing.service.gov.uk/media/657b03c8095987000d95e120/MASTER_FINAL_2023-24_FReM___1_.pdf#page=58"]
[null,null,"FReM 6.6.15",null,59,"https://assets.publishing.service.gov.uk/media/657b03c8095987000d95e120/MASTER_FINAL_2023-24_FReM___1_.pdf#page=59"]
[null,null,"FReM 6.6.7",null,59,"https://assets.publishing.service.gov.uk/media/657b03c8095987000d95e120/MASTER_FINAL_2023-24_FReM___1_.pdf#page=59"]
[null,null,"FReM 6.6.8",null,57,"https://assets.publishing.service.gov.uk/media/657b03c8095987000d95e120/MASTER_FINAL_2023-24_FReM___1_.pdf#page=57"]
[null,null,"FReM 6.6.8",null,57,"https://assets.publishing.service.gov.uk/media/657b03c8095987000d95e120/MASTER_FINAL_2023-24_FReM___1_.pdf#page=57"]
[null,null,"FReM 6.6.8",null,57,"https://assets.publishing.service.gov.uk/media/657b03c8095987000d95e120/MASTER_FINAL_2023-24_FReM___1_.pdf#page=57"]
{"$rows_left_out":57}